[RDP] Current V1 CVS is broken....

Stephen J. McCracken sjmccracky at cox.net
Thu Mar 19 11:44:32 EDT 2009


Fred Gleason wrote:
> On Wednesday 18 March 2009 06:15:15 pm Dan Mills wrote:
>> rdpopup.cpp:64: error: ‘exit’ was not declared in this scope
>> rdpopup.cpp:79: error: ‘exit’ was not declared in this scope
>> make[2]: *** [rdpopup.o] Error 1
>>
>> I think someone forgot to #include stdlib.h!
> 
> You would tell me this *after* I did the release...  :)

Which brings up the points:

- What is the policy, if any, of when point or major number releases happen.

- Is there any test-suite that runs before a release happens.

sjm


More information about the Rivendell-prog mailing list