[RDD] Build problem: HPI_SAMPLECLOCK_SOURCE was not declared

David E Smith David.E.Smith at nau.edu
Thu Nov 6 19:09:24 EST 2008


One of my machines gives me this when building Rivendell 1.1.0 from 
source (tar.gz on the downloads page).  It is interesting to note that 
my other machines all build fine.  Thoughts?

-- David

make[1]: Entering directory `/root/build/rivendell-1.1.0/rdhpi'
if /bin/bash ../libtool --tag=CXX --mode=compile g++ 
-DPACKAGE_NAME=\"rivendell\" -DPACKAGE_TARNAME=\"rivendell\" 
-DPACKAGE_VERSION=\"\`cat\ PACKAGE_VERSION\`\" 
-DPACKAGE_STRING=\"rivendell\ \`cat\ PACKAGE_VERSION\`\" 
-DPACKAGE_BUGREPORT=\"Fred\ Gleason\ \<fredg at paravelsystems.com\>\" 
-DPACKAGE=\"rivendell\" -DVERSION=\"1.1.0\" -DSTDC_HEADERS=1 
-DHAVE_SYS_TYPES_H=1 -DHAVE_SYS_STAT_H=1 -DHAVE_STDLIB_H=1 
-DHAVE_STRING_H=1 -DHAVE_MEMORY_H=1 -DHAVE_STRINGS_H=1 
-DHAVE_INTTYPES_H=1 -DHAVE_STDINT_H=1 -DHAVE_UNISTD_H=1 -DHAVE_DLFCN_H=1 
-DHAVE_VORBIS=1 -DHPI=yes -DJACK=yes -DALSA=yes -DSRC=yes -I. -I. 
-I../lib -Wall -DPREFIX=\"/usr/local\" -DQTDIR=\"\" -I/usr/include/qt3 
-DQT_THREAD_SUPPORT   -g -O2 -MT rdhpisoundcard.lo -MD -MP -MF 
".deps/rdhpisoundcard.Tpo" -c -o rdhpisoundcard.lo rdhpisoundcard.cpp; \
	then mv -f ".deps/rdhpisoundcard.Tpo" ".deps/rdhpisoundcard.Plo"; else 
rm -f ".deps/rdhpisoundcard.Tpo"; exit 1; fi
  g++ -DPACKAGE_NAME=\"rivendell\" -DPACKAGE_TARNAME=\"rivendell\" 
"-DPACKAGE_VERSION=\"\`cat PACKAGE_VERSION\`\"" 
"-DPACKAGE_STRING=\"rivendell \`cat PACKAGE_VERSION\`\"" 
"-DPACKAGE_BUGREPORT=\"Fred Gleason <fredg at paravelsystems.com>\"" 
-DPACKAGE=\"rivendell\" -DVERSION=\"1.1.0\" -DSTDC_HEADERS=1 
-DHAVE_SYS_TYPES_H=1 -DHAVE_SYS_STAT_H=1 -DHAVE_STDLIB_H=1 
-DHAVE_STRING_H=1 -DHAVE_MEMORY_H=1 -DHAVE_STRINGS_H=1 
-DHAVE_INTTYPES_H=1 -DHAVE_STDINT_H=1 -DHAVE_UNISTD_H=1 -DHAVE_DLFCN_H=1 
-DHAVE_VORBIS=1 -DHPI=yes -DJACK=yes -DALSA=yes -DSRC=yes -I. -I. 
-I../lib -Wall -DPREFIX=\"/usr/local\" -DQTDIR=\"\" -I/usr/include/qt3 
-DQT_THREAD_SUPPORT -g -O2 -MT rdhpisoundcard.lo -MD -MP -MF 
.deps/rdhpisoundcard.Tpo -c rdhpisoundcard.cpp  -fPIC -DPIC -o 
.libs/rdhpisoundcard.o
rdhpisoundcard.cpp: In member function 'void RDHPISoundCard::HPIProbe()':
rdhpisoundcard.cpp:635: warning: dereferencing type-punned pointer will 
break strict-aliasing rules
rdhpisoundcard.cpp:728: error: 'HPI_SAMPLECLOCK_SOURCE' was not declared 
in this scope
make[1]: *** [rdhpisoundcard.lo] Error 1
make[1]: Leaving directory `/root/build/rivendell-1.1.0/rdhpi'
make: *** [install-recursive] Error 1


More information about the Rivendell-dev mailing list